{"text_format":"1","workbook":"xlsx","n_sheets":23,"sheets":["Start Here","Network","IOM Device","IOM Device - Energy Meter","SZ - Smart Equipment","SZ - 3rd Party Equipment","MZ- Zone Coordinator","MZ- Smart Equipment","MZ- 3rd Party Units","MZ- VAV Zones","MZ - COBP Zones","MZ- Bypass Damper","Adv. Application Controller","Fan Coil Units","Lighting","BOM","Pricing","Learning Videos","Smart Building Hub Videos","VAC100x Controllers Videos","Energy Meters","AOMS List Price","Source 1 Parts Ref"],"not_rendered":{"charts":0,"images":20,"macros":1,"external_links":0,"defined_names":11,"comments":0,"pivot_tables":0},"unopened":[],"bounds":{"document_bytes":16777216,"sheet_cells":100000,"rows_first":2000,"rows_last":500,"rows_between":2000,"halvings":0,"cell_chars":16384,"cell_head_chars":4096},"cells_cut":0,"cells_raw":0,"read":"whole","date_system":"1900"}

{"sheet":"Start Here","index":0,"n_rows":37,"n_cols":25,"rows_kept":37,"cut":false,"hidden":false,"merged":[[5,1,5,15],[35,22,35,26]]}
[]
[]
[]
[]
[null,"How to use selection pages."]
[null,"Selection Pages is setup to estimate a single Verasys Job.  This sheet is intended to be used by customers that will procure the product through JCI's order management system in AOMS or UST.  Click the \"Start\" Button and complete each page as needed until you reach the final \"Bill of Materials\" (BOM) page.  The BOM page will list out all selected products; once filtered to remove the zero quantities it can be faxed or emailed to place the order.  \n\nIf you have any application questions or selection assitance please contact call the Verasys Hotline at 1-866-663-6105, Mon-Fri 8am - 4pm CST"]
[]
[]
[]
[]
[]
[]
[]
[]
[]
{"$rows_left_out":23}
{"sheet":"Network","index":1,"n_rows":23,"n_cols":6,"rows_kept":23,"cut":false,"hidden":false,"merged":[[7,1,7,2],[4,1,5,7],[15,1,15,2],[11,1,11,2]]}
[]
[]
[]
[]
[null,"Verasys Network Selection Page"]
[]
[]
[null,"Smart Building Hub"]
[null,"JCI Part Numbers","Required for all new sites!",null,null,"Qty"]
[null,"LC-SBH200-0","Verasys Smart Building Hub",null,null,0]
[]
[null,"Smart Building Hub Accessories",null,null,null,"Qty"]
[null,"ACC-PWRKIT-1A24","Verasys LC-SBH200-0 Power Supply (Recommended!)",null,null,0]
[null,"ACC-WIFIKIT-0DU","Verasys LC-SBH200-0 USB Wi-Fi Stick",null,null,0]
[]
{"$rows_left_out":9}
{"sheet":"IOM Device","index":2,"n_rows":61,"n_cols":6,"rows_kept":61,"cut":false,"hidden":false,"merged":[[62,1,62,2],[4,1,5,5],[14,1,14,3],[7,1,7,3],[45,1,45,3],[53,1,53,3]]}
[]
[]
[]
[]
[null,"Verasys IOM Device Page"]
[]
[]
[null,"IOM Device"]
[null,"JCI Part Numbers","Descriptions","Qty"]
[null,"LC-VAC1002-0","Verasys Input Output Configurable Controller, NOTE! 4 Binary Inputs, 5 Analog Inputs, 9 Binary Outputs per IOM",0,null,0]
[null,"PA0000004GC0","Panel Enclosure for a single IOM device (12 x 16 x 6.5 in, 40 VA)",0]
[null,"PA0000001AH0","Panel Enclosure for two IOM devices (20 x 24 x 6.5 in, 96 VA)",0]
[null,"PA0000001EH0","Panel Enclosure for three IOM devices (24 x 24 x 6.5 in 96 VA)",0]
[]
[null,"IOM Accessories: Hardwired Input and Output Devices"]
{"$rows_left_out":47}
{"sheet":"IOM Device - Energy Meter","index":3,"n_rows":35,"n_cols":7,"rows_kept":35,"cut":false,"hidden":false,"merged":[[4,1,5,11],[7,1,8,11]]}
[]
[]
[]
[]
[null,"Verasys IOM Energy Meter Part Number Creation"]
[]
[]
[null,"Note: Energy Meter Part Numbers are created by the combination of Phases supported, CVT Amps, and CVT Lead Length. EMC meters are the only meters supported on the Verasys IOM. Input the data in the table below and Click the \"Create Part Number\" Button."]
[]
[]
[]
[]
[]
[]
[]
{"$rows_left_out":21}
{"sheet":"SZ - Smart Equipment","index":4,"n_rows":28,"n_cols":4,"rows_kept":28,"cut":false,"hidden":false,"merged":[[4,1,5,3],[7,1,7,2]]}
[]
[]
[]
[]
[null,"Single Zone Smart Equipment Selection Page"]
[]
[]
[null,"NetStats for Zone Temperature"]
[null,"JCI Part Numbers \n(Required)","Typically one Zone Temperature sensor is required per single zone RTU, but Verasys can average up to 3 sensors per RTU. ","Qty"]
[null,"NS-BTB7003-0","Net Sensor, 120x80, JCI Logo, LCD Display, Local Setpoint, Terminals (Dial)",0]
[null,"NS-BTB7003-2","Net Sensor, 120x80, No Logo, LCD Display, Local Setpoint, Terminals (Dial)",0]
[null,"NS-BTN7003-0","Net Sensor, 120x80, JCI Logo, No Display, No Setpoint, Terminals",0]
[null,"NS-BTN7003-2","Net Sensor, 120x80, No Logo, No Display, No Setpoint, Terminals",0]
[null,"NS-BTP7002-0","Net Sensor, 120x80, JCI Logo, No Display, Warmer/Cooler Adjustment, Terminals",0]
[null,"NS-BTP7002-2","Net Sensor, 120x80, No Logo, No Display, Warmer/Cooler Adjustment, Terminals",0]
{"$rows_left_out":14}
{"sheet":"SZ - 3rd Party Equipment","index":5,"n_rows":52,"n_cols":13,"rows_kept":52,"cut":false,"hidden":false,"merged":[[33,1,33,3],[29,2,29,5],[30,2,30,5],[4,1,5,9],[7,1,7,8],[15,1,15,8],[23,1,23,8],[28,2,28,5],[25,2,25,5],[24,2,24,8]]}
[]
[]
[]
[]
[null,"Single Zone Verasys \"3rd Party\" Standard Equipment"]
[null,null,null,null,null,null,null,null,null,null,null,null,"Check Equipment!!!"]
[]
[null,"Wired TEC3000 Thermostats | Verasys Smart Thermostats"]
[]
[null,"JCI Part Number","System Covered","JCI Logo","Htg/Clg Signals","Occupancy Sensor",null,null,"Qty"]
[null,"TEC3630-00-000","RTU, Heatpump, Furnace, Unit Heater","Yes","On/Off","No",null,null,0]
[null,"TEC3631-00-000","RTU, Heatpump, Furnace, Unit Heater","Yes","On/Off","Yes",null,null,0]
[null,"TEC3630-01-000","RTU, Heatpump, Furnace, Unit Heater","No","On/Off","No",null,null,0]
[null,"TEC3631-01-000","RTU, Heatpump, Furnace, Unit Heater","No","On/Off","Yes",null,null,0]
[]
{"$rows_left_out":38}
{"sheet":"MZ- Zone Coordinator","index":6,"n_rows":17,"n_cols":6,"rows_kept":17,"cut":false,"hidden":false,"merged":[[7,1,7,2],[4,1,5,6]]}
[]
[]
[]
[]
[null,"Multi-Zone Zone Coordinators"]
[]
[]
[null,"Zone Coordinators"]
[null,"JCI Part Numbers","Note: Each Zoning Coordinator can control up to 32 Boxes and/or Zones.  One Coordinator is required per VAV or COBP RTU. ",null,null,"Qty"]
[null,"LC-VZC100-0","Verasys Zoning Coordinator for VAV and COBP applications (Loose Board Version)",null,null,0]
[null,"LC-VZCPNL-0","Verasys Zoning Coordinator for VAV and COBP applications (Panel Version)",null,null,0]
[]
[null,"Transformers","Power for all the Zone Coordinators, VAV Boxes and Zone Controllers",null,null,"Qty"]
[null,"Y65T42-0","120/208/240 to 24V XFR 40VA (Power for 2 Controllers)",null,null,0]
[null,"PSH100A","120V to 24V XFR, 100VA (Power for 6 Controllers)",null,null,0]
{"$rows_left_out":3}
{"sheet":"MZ- Smart Equipment","index":7,"n_rows":56,"n_cols":7,"rows_kept":56,"cut":false,"hidden":false,"merged":[[4,1,5,9]]}
[]
[]
[]
[]
[null,"Multi-Zone Smart Equipment Page"]
[]
[]
[]
[null,null,"Select unit with BACnet Card.  If the unit does not have a BACnet card add this part."]
[null,"Smart Equipment BACnet Card",null,0]
[null,"JCI Part Numbers",null,0,null,"Qty"]
[null,"SE-COM1001-0","Smart Equipment BACnet Communications Card Required!",0,null,0]
[null,null,null,0]
[null,null,null,0]
[null,null,null,0]
{"$rows_left_out":42}
{"sheet":"MZ- 3rd Party Units","index":8,"n_rows":38,"n_cols":6,"rows_kept":38,"cut":false,"hidden":false,"merged":[[4,1,5,9],[7,1,7,5],[11,1,11,5]]}
[]
[]
[]
[]
[null,"Multi-Zone \"3rd Party\" Equipment Controller Selection"]
[]
[]
[null,"3rd Party RTU Controller"]
[null,"JCI Part Numbers","If you have a Simplicity Smart Equipment Unit this is not needed",null,null,"Qty"]
[null,"LC-VEC100-0","Verasys Equipment Controller, 3rd Party RTU (VAV, COPB)",null,null,0]
[]
[null,"LC-VEC100-0 3rd Party RTU Controller Accessories"]
[null,"Duct Sensors","For Supply Air Temperature mandatory, Return Air Temperature (Optional). ",null,null,"Qty"]
[null,"TE-6311M-1","8\" Duct Sensor Metal Enclosure, Nickel",null,null,0]
[]
{"$rows_left_out":24}
{"sheet":"MZ- VAV Zones","index":9,"n_rows":35,"n_cols":5,"rows_kept":35,"cut":false,"hidden":false,"merged":[[4,1,5,5],[7,1,7,2],[13,1,13,2]]}
[]
[]
[]
[]
[null,"Multi-Zone VAV Controller Selection Page"]
[]
[]
[null,"VAV Controllers"]
[null,"JCI Part Numbers","Pick the model that covers the heating you need.  All models can do cooling only.",null,"Qty"]
[null,"LC-ZEC410-1","Configurable VAV Box Controller, All Fan Types, Stg Box Htg",null,0]
[null,"LC-ZEC410-2","Configurable VAV Box Controller, All Fan Types, Inc Box Htg",null,0]
[null,"LC-ZEC410-3","Configurable VAV Box Controller, All Fan Types, Prop(SCR) Box Htg",null,0]
[]
[null,"NetStats for Zone Temperature",null,null,"Qty"]
[null,"NS-BTB7003-0","Net Sensor, 120x80, JCI Logo, LCD Display, Local Setpoint, Terminals (Dial)",null,0]
{"$rows_left_out":21}
{"sheet":"MZ - COBP Zones","index":10,"n_rows":62,"n_cols":8,"rows_kept":62,"cut":false,"hidden":false,"merged":[[43,1,43,2],[4,1,5,8],[11,7,23,7],[24,7,36,7],[7,1,7,2],[39,1,39,2]]}
[]
[]
[]
[]
[null,"Multi-Zone COBP Zone Damper Selection Page"]
[]
[]
[null,"COBP Zone Dampers/Controllers"]
[null,"JCI Part Numbers",null,null,null,"Qty"]
[null,"LC-ZEC310-0","Field Installed, Zone Damper Controller No Damper",null,null,0]
[null,"RCG04B","4\" Round Zone/Bypass Damper No Controller ",null,null,0]
[null,"RCG06B","6\" Round Zone/Bypass Damper No Controller ",null,null,0,null,"5 Day Lead-time"]
[null,"RCG07B","7\" Round Zone/Bypass Damper No Controller ",null,null,0]
[null,"RCG08B","8\" Round Zone/Bypass Damper No Controller ",null,null,0]
[null,"RCG09B","9\" Round Zone/Bypass Damper No Controller ",null,null,0]
{"$rows_left_out":48}
{"sheet":"MZ- Bypass Damper","index":11,"n_rows":49,"n_cols":8,"rows_kept":49,"cut":false,"hidden":false,"merged":[[10,7,22,7],[23,7,35,7],[7,1,7,2],[4,1,5,8]]}
[]
[]
[]
[]
[null,"Multi-Zone COBP Bypass Controller Selection Page"]
[]
[]
[null,"Bypass Control"]
[null,"JCI Part Numbers",null,null,null,"Qty"]
[null,"LC-BYP200-0","Field Installed, Bypass Damper Controller - No Damper",null,null,0]
[null,"RCG06B","6\" Round Zone/Bypass Damper No Controller ",null,null,0,null,"5 Day Lead-time"]
[null,"RCG07B","7\" Round Zone/Bypass Damper No Controller ",null,null,0]
[null,"RCG08B","8\" Round Zone/Bypass Damper No Controller ",null,null,0]
[null,"RCG09B","9\" Round Zone/Bypass Damper No Controller ",null,null,0]
[null,"RCG10B","10\" Round Zone/Bypass Damper No Controller ",null,null,0]
{"$rows_left_out":35}
{"sheet":"Adv. Application Controller","index":12,"n_rows":75,"n_cols":11,"rows_kept":75,"cut":false,"hidden":false,"merged":[[71,2,71,6],[66,1,66,6],[67,2,67,6],[68,2,68,3],[69,2,69,3],[70,2,70,3],[40,1,40,6],[46,2,46,3],[47,2,47,3],[48,2,48,3],[49,2,49,3],[41,2,41,3],[42,2,42,3],[43,2,43,3],[44,2,44,3],[45,2,45,3],[36,2,36,3],[37,2,37,3],[38,2,38,3],[39,2,39,3],[64,2,64,3],[55,2,55,3],[56,2,56,3],[60,2,60,3],[51,1,51,6],[52,2,52,3],[53,2,53,3],[54,2,54,3],[58,1,58,6],[59,2,59,3],[62,1,62,6],[63,2,63,3],[27,2,27,3],[28,2,28,3],[29,2,29,3],[31,2,31,3],[35,2,35,3],[33,2,33,3],[21,2,21,3],[22,2,22,3],[24,2,24,3],[25,2,25,3],[26,2,26,3],[23,2,23,3],[73,2,73,3],[74,2,74,3],[4,1,5,7],[8,1,8,6],[13,1,13,6],[10,2,10,3],[11,2,11,3],[9,2,9,3],[32,2,32,3],[14,2,14,6],[15,2,15,3],[16,2,16,3],[17,2,17,3],[18,2,18,3],[19,2,19,3],[20,2,20,3]]}
[]
[]
[]
[]
[null,"Verasys \"3rd Party\" Advanced Application Controller"]
[]
[]
[]
[null,"LC-VAC-x000 Controllers | Verasys Application Controller"]
[null,"JCI Part Number","Description",null,null,null,"Qty"]
[null,"LC-VAC1000-0","18 Point 24v, Application Controller with no application loaded",null,null,null,0]
[null,"LC-VAC3000-0","32 Point 24v, Application Controller with no application loaded",null,null,null,0,null,null,null,"Check Applications!!!"]
[]
[null,"18 Point VAC Application Controller Accessories"]
[null,"JCI Part Number","Description"]
{"$rows_left_out":61}
{"sheet":"Fan Coil Units","index":13,"n_rows":67,"n_cols":8,"rows_kept":67,"cut":false,"hidden":false,"merged":[[47,2,47,5],[7,1,7,6],[4,1,5,7],[26,1,26,6],[45,1,45,6],[46,2,46,5],[50,2,50,5],[51,2,51,5],[52,2,52,5],[54,1,54,3],[49,1,49,6]]}
[]
[]
[]
[]
[null,"Fan Coil Unit Selection Page"]
[]
[]
[null,"Wired TEC300 Thermostats | Verasys Smart FanCoil Thermostats"]
[null,"JCI Part Numbers","System Covered","JCI Logo","Htg/Clg Signals","Occupancy Sensor","Humidity Control","Qty"]
[null,"TEC3610-00-000","Fan Coil On/Off or Floating Outputs","Yes","On/Off or Floating","No","No",0]
[null,"TEC3611-00-000","Fan Coil On/Off or Floating Outputs","Yes","On/Off or Floating","Yes","No",0]
[null,"TEC3612-00-000","Fan Coil On/Off or Floating Outputs","Yes","On/Off or Floating","No","Yes",0]
[null,"TEC3613-00-000","Fan Coil On/Off or Floating Outputs","Yes","On/Off or Floating","Yes","Yes",0]
[null,"TEC3620-00-000","Fan Coil Proportional Outputs","Yes","0-10VDC","No","No",0]
[null,"TEC3621-00-000","Fan Coil Proportional Outputs","Yes","0-10VDC","Yes","No",0]
{"$rows_left_out":53}
{"sheet":"Lighting","index":14,"n_rows":21,"n_cols":7,"rows_kept":21,"cut":false,"hidden":false,"merged":[[67,2,67,3],[68,2,68,3],[69,2,69,3],[70,2,70,6],[59,2,59,3],[61,1,61,6],[62,2,62,3],[63,2,63,3],[65,1,65,6],[66,2,66,6],[58,2,58,3],[45,2,45,3],[46,2,46,3],[47,2,47,3],[48,2,48,3],[50,1,50,6],[51,2,51,3],[52,2,52,3],[53,2,53,3],[54,2,54,3],[55,2,55,3],[57,1,57,6],[44,2,44,3],[36,2,36,3],[37,2,37,3],[38,2,38,3],[39,1,39,6],[40,2,40,3],[41,2,41,3],[42,2,42,3],[43,2,43,3],[19,2,19,3],[20,2,20,3],[21,2,21,3],[22,2,22,3],[23,2,23,3],[24,2,24,3],[25,2,25,3],[26,2,26,3],[27,2,27,3],[18,2,18,3],[4,1,5,7],[8,1,8,6],[9,2,9,3],[10,2,10,3],[12,1,12,6],[13,2,13,6],[14,2,14,3],[15,2,15,3],[16,2,16,3],[17,2,17,3]]}
[]
[]
[]
[]
[null,"Verasys Lighting Controller"]
[]
[]
[]
[null,"LC-VAC1001 Controllers | Verasys Lighting Applications"]
[null,"JCI Part Number","Description",null,null,null,"Qty"]
[null,"LC-VAC1001-0","18 Point 24v, Application Controller with Lighting Application",null,null,null,0]
[]
[null,"Lighting Accessories"]
[null,"JCI Part Number","Description"]
[null,"Light Sensors",null,null,null,null,"Qty"]
{"$rows_left_out":7}
{"sheet":"BOM","index":15,"n_rows":281,"n_cols":7,"rows_kept":281,"cut":false,"hidden":false,"merged":[[10,0,10,6],[9,0,9,3]]}
[]
[]
[]
[]
[]
[]
[]
[]
[]
["This page is a summary of what was selected in the previous pages"]
["Bill of Materials"]
["System","Function","Source 1 Part No","JCI Part No","Description","Qty","Video Tracks"]
["Network","Smart Building Hub",{"$f":"VLOOKUP(D13,'Source 1 Parts Ref'!A$2:B$239,2,FALSE)","v":"S1-LC-SBH200-0"},"LC-SBH200-0","Verasys Smart Building Hub",{"$f":"Network!F10","v":0},"Video Available!"]
["Network","Smart Building Hub Power",{"$f":"VLOOKUP(D14,'Source 1 Parts Ref'!A$2:B$239,2,FALSE)","v":{"$error":"#N/A"}},"ACC-PWRKIT-1A24","Verasys LC-SBH200-0 Power Supply",{"$f":"Network!F13","v":0}]
["Network","Smart Building Hub WiFi",{"$f":"VLOOKUP(D15,'Source 1 Parts Ref'!A$2:B$239,2,FALSE)","v":{"$error":"#N/A"}},"ACC-WIFIKIT-ODU","Verasys LC-SBH200-0 USB Wi-Fi Stick",{"$f":"Network!F14","v":0}]
{"$rows_left_out":267}
{"sheet":"Pricing","index":16,"n_rows":284,"n_cols":7,"rows_kept":284,"cut":false,"hidden":true,"merged":[[13,0,13,6],[11,4,11,5]]}
[]
[]
[]
[]
[]
[]
[]
[]
[]
[]
[]
[null,null,null,null,"List Grand Total:",null,{"$f":"SUM(G16:G281)","v":0}]
[]
["Bill of Materials"]
["System","Function",null,"JCI Part No","List Price","Qty","Total (List * Qty) USD"]
{"$rows_left_out":270}
{"sheet":"Learning Videos","index":17,"n_rows":38,"n_cols":5,"rows_kept":38,"cut":false,"hidden":false,"merged":[]}
[]
[]
[]
[]
[]
[]
[]
[]
[]
[null,"System","Device(s)","Video Description (Click the Titles!)","Should You Watch?"]
[null,"Network","Smart Building Hub","Smart Building Hub Hardware SBH200",{"$f":"IF(BOM!F$13=1,\"Yes\",\"No\")","v":"No"}]
[null,"Network","Smart Building Hub","How to set Schedules in Verasys",{"$f":"IF(BOM!F$13=1,\"Yes\",\"No\")","v":"No"}]
[null,"Network","Smart Building Hub","How to setup new users and setup email and texting",{"$f":"IF(BOM!F$13=1,\"Yes\",\"No\")","v":"No"}]
[null,"Network","Smart Building Hub","Smart building Hub Alarm Notification",{"$f":"IF(BOM!F$13=1,\"Yes\",\"No\")","v":"No"}]
[null,"Network","Smart Building Hub","How to setup Smart Building hub ethernet and internet settings",{"$f":"IF(BOM!F$13=1,\"Yes\",\"No\")","v":"No"}]
{"$rows_left_out":24}
{"sheet":"Smart Building Hub Videos","index":18,"n_rows":16,"n_cols":3,"rows_kept":16,"cut":false,"hidden":true,"merged":[[6,1,12,1],[14,1,15,1]]}
[]
[]
[]
[]
[]
[null,"Audience","Video Description"]
[null,"Installers","How to setup new users and setup email and texting"]
[null,null,"How to setup Smart Building hub ethernet and internet settings"]
[null,null,"How to upgrade software on the Smart Building Hub"]
[null,null,"Smart Building Hub SBH200 Connecting for the First Time"]
[null,null,"Smart Building Hub Hardware SBH200"]
[null,null,"How to set Schedules in Verasys"]
[null,null,"Smart building Hub Alarm Notification"]
[]
[null,"Trouble Shooting","Smart building Hub Alarm Notification"]
{"$rows_left_out":2}
{"sheet":"VAC100x Controllers Videos","index":19,"n_rows":11,"n_cols":3,"rows_kept":11,"cut":false,"hidden":true,"merged":[[6,1,10,1]]}
[]
[]
[]
[]
[]
[null,"Audience","Video Description"]
[null,"Installers","VAC1002 Connecting to an Energy Meter"]
[null,null,"VAC Controller Family Hardware"]
[null,null,"VAC1002 Connecting to Wireless One to One Sensors"]
[null,null,"VAC1001 Lighting Controller Configuration"]
[null,null,"VAC1002 Input Output Configuration"]

{"sheet":"Energy Meters","index":20,"n_rows":38,"n_cols":2,"rows_kept":38,"cut":false,"hidden":true,"merged":[]}
["SENVA-01-EMC-3N-03S-03","ENERGY METER KIT, COMMS TYPE, 3 CVT, NO FUSE, 300A, 9 IN CIRCUM., 3FT LEAD "]
["SENVA-01-EMC-3N-03S-10","ENERGY METER KIT, COMMS TYPE, 3 CVT, NO FUSE, 300A, 9 IN CIRCUM. 10FT LEAD "]
["SENVA-01-EMC-3N-08S-03","ENERGY METER KIT, COMMS TYPE, 3 CVT, NO FUSE, 800A, 9 IN CIRCUM., 3FT LEAD "]
["SENVA-01-EMC-3N-08S-10","ENERGY METER KIT, COMMS TYPE, 3 CVT, NO FUSE, 800A, 9 IN CIRCUM. 10FT LEAD "]
["SENVA-01-EMC-3N-08M-03","ENERGY METER KIT, COMMS TYPE, 3 CVT, NO FUSE, 800A, 15IN CIRCUM., 3FT LEAD"]
["SENVA-01-EMC-3N-08M-10","ENERGY METER KIT, COMMS TYPE, 3 CVT, NO FUSE, 800A, 15IN CIRCUM. 10FT LEAD"]
["SENVA-01-EMC-3N-15S-03","ENERGY METER KIT, COMMS TYPE, 3 CVT, NO FUSE, 1500A, 9 IN CIRCUM., 3FT LEAD"]
["SENVA-01-EMC-3N-15S-10","ENERGY METER KIT, COMMS TYPE, 3 CVT, NO FUSE, 1500A, 9 IN CIRCUM. 10FT LEAD"]
["SENVA-01-EMC-3N-15M-03","ENERGY METER KIT, COMMS TYPE, 3 CVT, NO FUSE, 1500A, 15IN CIRCUM. 3FT LEAD"]
["SENVA-01-EMC-3N-15M-10","ENERGY METER KIT, COMMS TYPE, 3 CVT, NO FUSE, 1500A, 15IN CIRCUM.10FT LEAD"]
["SENVA-01-EMC-3N-24M-03","ENERGY METER KIT, COMMS TYPE, 3 CVT, NO FUSE, 2400A, 15IN CIRCUM. 3FT LEAD"]
["SENVA-01-EMC-3N-24M-10","ENERGY METER KIT, COMMS TYPE, 3 CVT, NO FUSE, 2400A, 15IN CIRCUM.10FT LEAD"]
["SENVA-01-EMC-3N-24L-03","ENERGY METER KIT, COMMS TYPE, 3 CVT, NO FUSE, 2400A, 24IN CIRCUM. 3FT LEAD"]
["SENVA-01-EMC-3N-24L-10","ENERGY METER KIT, COMMS TYPE, 3 CVT, NO FUSE, 2400A, 24IN CIRCUM.10FT LEAD"]
["SENVA-01-EMC-3N-60G-03","ENERGY METER KIT, COMMS TYPE, 3 CVT, NO FUSE, 6000A, 36IN CIRCUM. 3FT LEAD"]
{"$rows_left_out":24}
{"sheet":"AOMS List Price","index":21,"n_rows":243,"n_cols":2,"rows_kept":243,"cut":false,"hidden":true,"merged":[]}
["JCI Part Number","AOMS List Price"]
["RCG18B",341.60180000000003]
["RCG17B",320.53480000000002]
["RCG16B",269.077]
["RCG15B",259.7088]
["RCG14B",255.047]
["RCG13B",238.64179999999999]
["RCG12B",226.9427]
["RCG11B",219.95]
["RCG10B",208.20590000000001]
["RCG09B",205.92]
["RCG08B",201.2139]
["RCG07B",196.55179999999999]
["RCG06B",191.8458]
["RCG04B",189.51480000000001]
{"$rows_left_out":229}
{"sheet":"Source 1 Parts Ref","index":22,"n_rows":239,"n_cols":9,"rows_kept":239,"cut":false,"hidden":true,"merged":[]}
["JCI Part No","Source 1 Part No"]
["LC-SBH100-1","S1-LC-SBH100-1"]
["LC-IOM100-0","S1-LC-IOM100-0"]
["Y65T42-0","S1-Y65T42-0"]
["TE-68NT-0N00S","S1-TE68NT1N00S"]
["TE-6311M-1","S1-TE-6311M-1"]
["TE-6313P-1","S1-TE-6313P-1"]
["HE-68N3-0N00WS","S1-H68N30N00WS"]
["HE-68P3-0N000","S1-H68P30N000"]
["HE-67N3-0N00P","S1-H67N30N00P"]
["CD-W00-00-2","S1-CDW-00-00-2"]
["NS-BTB7003-0","S1-NSBTB7003-0"]
["NS-BTB7003-2","S1-NSBTB7003-2"]
["NS-BTN7003-0","S1-NSBTN7003-0"]
["NS-BTN7003-2","S1-NSBTN7003-2"]
{"$rows_left_out":224}